ubuntu20.04 MYNTEYE S 相机运行与标定记录

ubuntu20.04 MYNTEYE S 相机运行与标定记录

环境

ubuntu20.04
opencv3.3.1

硬件

mynteye S1030

OpenCV 3.4.3 安装

Jetson Nano+小觅相机(MYNT EYE S)开发调试指南

mkdir -p ~/tools/opencv
cd ~/tools/opencvgit clone https://github.com/opencv/opencv.git
cd opencv/
git checkout tags/3.4.3cd ~/tools/opencv
mv opencv opencv-3.4.3
cd opencv-3.4.3/mkdir build
cd build
cmake  -DCMAKE_INSTALL_PREFIX=/home/robot/tools/opencv/opencv-3.4.3/build/installed ..
make
make install

cv_bridge配置

mkdir -p ~/workspace/MYNT_EYE/S_SDK/src
cd ~/workspace/MYNT_EYE/S_SDK/srccatkin initgit clone https://github.com/ros-perception/vision_opencv.git --branch melodic   # melodic对应1.13版本mv vision_opencv/cv_bridge ./
rm -rf vision_opencv# 修改CMakeLists.txt和package.xml中的package name为cv_bridge_3
catkin_make

MYNT-EYE-S-SDK

cd ~/workspace/MYNT_EYE/S_SDK/src
git clone https://github.com/slightech/MYNT-EYE-S-SDK.git
cd MYNT-EYE-S-SDK
make install  # 见ERROR 1cd ~/workspace/MYNT_EYE/S_SDK
catkin_make   # 见ERROR 2 3 4 5# 测试
cd ~/workspace/MYNT_EYE/S_SDK
source devel/setup.bash
roslaunch mynt_eye_ros_wrapper display.launch

ERROR 1:
忘记是什么报错了,忘记复制了。但是是cv相关的报错,是因为忘记添加OpenCV_LIB_PATH了。
FIX:
在MYNT-EYE-S-SDK/CMakeLists.txt中添加

set(OpenCV_DIR /home/robot/tools/opencv/opencv-3.4.3/build)
set(OpenCV_LIB_PATH /home/robot/tools/opencv/opencv-3.4.3/build/installed/lib)

ERROR 2:

-- Could NOT find cv_bridge (missing: cv_bridge_DIR)
-- Could not find the required component 'cv_bridge'. The following CMake error indicates that you either need to install the package with the same name or change your environment so that it can be found.
CMake Error at /opt/ros/noetic/share/catkin/cmake/catkinConfig.cmake:83 (find_package):Could not find a package configuration file provided by "cv_bridge" withany of the following names:cv_bridgeConfig.cmakecv_bridge-config.cmakeAdd the installation prefix of "cv_bridge" to CMAKE_PREFIX_PATH or set"cv_bridge_DIR" to a directory containing one of the above files.  If"cv_bridge" provides a separate development package or SDK, be sure it hasbeen installed.
Call Stack (most recent call first):MYNT-EYE-S-SDK/wrappers/ros/src/mynt_eye_ros_wrapper/CMakeLists.txt:36 (find_package)-- Configuring incomplete, errors occurred!
See also "/home/robot/tools/MYNT_EYE/S_SDK/build/CMakeFiles/CMakeOutput.log".
See also "/home/robot/tools/MYNT_EYE/S_SDK/build/CMakeFiles/CMakeError.log".
Invoking "cmake" failed

FIX:
在catkin_ws中增加了cv_bridge并将其package修改为了cv_bridge_3,但是在SDK中的wrappers/ros/src中的CMakeLists.txt中将find_package中的cv_bridge也要修改成对应空间中的cv_bridge_3.

find_package(catkin REQUIRED COMPONENTScv_bridge_3geometry_msgsimage_transportmessage_generationnodeletroscppsensor_msgsstd_msgstf
)

ERROR 3:

-- Could NOT find image_transport (missing: image_transport_DIR)
-- Could not find the required component 'image_transport'. The following CMake error indicates that you either need to install the package with the same name or change your environment so that it can be found.
CMake Error at /opt/ros/noetic/share/catkin/cmake/catkinConfig.cmake:83 (find_package):Could not find a package configuration file provided by "image_transport"with any of the following names:image_transportConfig.cmakeimage_transport-config.cmakeAdd the installation prefix of "image_transport" to CMAKE_PREFIX_PATH orset "image_transport_DIR" to a directory containing one of the above files.If "image_transport" provides a separate development package or SDK, besure it has been installed.
Call Stack (most recent call first):MYNT-EYE-S-SDK/wrappers/ros/src/mynt_eye_ros_wrapper/CMakeLists.txt:36 (find_package)-- Configuring incomplete, errors occurred!
See also "/home/robot/tools/MYNT_EYE/S_SDK/build/CMakeFiles/CMakeOutput.log".
See also "/home/robot/tools/MYNT_EYE/S_SDK/build/CMakeFiles/CMakeError.log".
make: *** [Makefile:782: cmake_check_build_system] Error 1
Invoking "make cmake_check_build_system" failed

找不到image_transport
FIX:
在wrappers/ros/src/CMakeLists.txt中添加set(image_transport_DIR /opt/ros/noetic/share/image_transport/cmake)

ERROR 4:

-- Could NOT find message_generation (missing: message_generation_DIR)
-- Could not find the required component 'message_generation'. The following CMake error indicates that you either need to install the package with the same name or change your environment so that it can be found.
CMake Error at /opt/ros/noetic/share/catkin/cmake/catkinConfig.cmake:83 (find_package):Could not find a package configuration file provided by"message_generation" with any of the following names:message_generationConfig.cmakemessage_generation-config.cmakeAdd the installation prefix of "message_generation" to CMAKE_PREFIX_PATH orset "message_generation_DIR" to a directory containing one of the abovefiles.  If "message_generation" provides a separate development package orSDK, be sure it has been installed.
Call Stack (most recent call first):MYNT-EYE-S-SDK/wrappers/ros/src/mynt_eye_ros_wrapper/CMakeLists.txt:38 (find_package)-- Configuring incomplete, errors occurred!
See also "/home/robot/tools/MYNT_EYE/S_SDK/build/CMakeFiles/CMakeOutput.log".
See also "/home/robot/tools/MYNT_EYE/S_SDK/build/CMakeFiles/CMakeError.log".
make: *** [Makefile:782: cmake_check_build_system] Error 1
Invoking "make cmake_check_build_system" failed

找不到message_generation。
FIX:
在wrappers/ros/src/CMakeLists.txt中添加set(message_generation_DIR /opt/ros/noetic/share/message_generation/cmake)

ERROR 5:

[ 88%] Linking CXX shared library /home/robot/tools/MYNT_EYE/S_SDK/devel/lib/libmynteye_wrapper.so
/usr/bin/ld: cannot find -lBoost::filesystem
collect2: error: ld returned 1 exit status
make[2]: *** [MYNT-EYE-S-SDK/wrappers/ros/src/mynt_eye_ros_wrapper/CMakeFiles/mynteye_wrapper.dir/build.make:144: /home/robot/tools/MYNT_EYE/S_SDK/devel/lib/libmynteye_wrapper.so] Error 1
make[1]: *** [CMakeFiles/Makefile2:2035: MYNT-EYE-S-SDK/wrappers/ros/src/mynt_eye_ros_wrapper/CMakeFiles/mynteye_wrapper.dir/all] Error 2
make: *** [Makefile:141: all] Error 2
Invoking "make -j8 -l8" failed

找不到Boost::filesystem
FIX:
修改wrappers/ros/src/CMakeLists.txt。

find_package(Boost REQUIRED COMPONENTS filesystem)
include_directories(${Boost_INCLUDE_DIRS})

S 系列相机标定

IMU标定

roslaunch mynt_eye_ros_wrapper vins_fusion.launch
rosbag record -O IMU_mynteye_s_calibration /mynteye/imu/data_raw

录制一个小时以上

roslaunch imu_utils mynteye_imu_calibration.launchrosbag play -r 200 IMU_mynteye_s_calibration.bag

标注

后续再继续标定,目前出现问题:

  1. 同样的IMU标定流程,手中的mynteye D相机正常标定,但是S相机标定时ERROR
  2. 双目标定时,mynteye D相机正常,但是S相机无法降低采样频率,每次降到4hz,相机进程就会被杀死。不清楚是不是因为驱动。

决定还是试试D455,主要目的是将D455标定结果和mynteye D相机进行对比。

本文来自互联网用户投稿,该文观点仅代表作者本人,不代表本站立场。本站仅提供信息存储空间服务,不拥有所有权,不承担相关法律责任。如若转载,请注明出处:http://www.mzph.cn/news/136765.shtml

如若内容造成侵权/违法违规/事实不符,请联系多彩编程网进行投诉反馈email:809451989@qq.com,一经查实,立即删除!

相关文章

Easypoi map方式导入数据 ,List<Map<String, String>> 日期项数据为空(null)解决办法

目录 前言解决办法 前言 在使用easypoi map的方式解析excel文件,若文件中的某列数据格式是日期类型,那么它这个工具是读取不到,因为它的源码读取到某列为日期格式,数据必须为字符串类型,它才会处理 switch (cell.get…

Linux - 实现一个简单的 shell

前言 之前我们对进程的替换,进程地址空间等等的概念进行了说明,本篇博客会基于这些知识点来 实现一个简单的 shell ,如有疑问,可以参考下述博客:Linux - 进程程序替换 - C/C 如何实现与各个语言之间的相互调用 - 替换…

flutter实践:慎用Expanded

问题:在一个Android原生的弹框里显示flutter view,由于使用了Expanded导致组件未显示出来 最神奇的地方在于debug调试模式显示正常,然后用release版本发布时怎么都显示不出来,还导致点击后无响应ANR 问题代码: child: Stateful…

【服务器学习】 iomanager IO协程调度模块

iomanager IO协程调度模块 以下是从sylar服务器中学的,对其的复习; 参考资料 继承自协程调度器,封装了epoll,支持为socket fd注册读写事件回调函数 IO协程调度还解决了调度器在idle状态下忙等待导致CPU占用率高的问题。IO协程调…

后台管理系统解决方案-中大型-Vben Admin

后台管理系统解决方案-中大型-Vben Admin 官网 Vben Admin 在线演示 Vben Admin 为什么选择它 github现有20K星,并且它有个可视化生成表单,我很喜欢 快速开始 # 拉取代码 git clone https://github.com/vbenjs/vue-vben-admin-doc# 安装依赖 yarn#…

访问控制列表

目录 ACL ACL原理 ACL包过滤方式 ACL通用命令 查看ACL表命令 删除整张表命令 接口配置ACL ACL分类 标准ACL 标准ACL的动作与条件 通配符掩码 扩展ACL 扩展ACL的动作与条件 命名ACL 前言 书写方式 ACL 含义:访问控制列表,其是一种包过滤…

idea module 重命名

在多模块的项目中,要对多模块的其中一个模块,进行重命名。 试了直接重命名,还是显示旧的。再是了下什么引入模块的方法,都不好使。看到《IDEA重命名一个模块(详细说明)》,操作起来,其实就比较麻烦。 索性&a…

竞赛 行人重识别(person reid) - 机器视觉 深度学习 opencv python

文章目录 0 前言1 技术背景2 技术介绍3 重识别技术实现3.1 数据集3.2 Person REID3.2.1 算法原理3.2.2 算法流程图 4 实现效果5 部分代码6 最后 0 前言 🔥 优质竞赛项目系列,今天要分享的是 🚩 深度学习行人重识别(person reid)系统 该项目…

某环保制造企业核心人才培养项目成功案例纪实

——如何培养核心人才,使企业持续保持竞争力 【客户行业】环保行业 【问题类型】人才培养 【客户背景】 某环保有限公司成立于2002年,位于南方某二线城市,是一家以处理废弃物、废旧资源为主的设备制造的民营企业,拥有从事专业…

【C++】STL容器适配器——queue类的使用指南(含代码使用)(18)

前言 大家好吖,欢迎来到 YY 滴C系列 ,热烈欢迎! 本章主要内容面向接触过C的老铁 主要内容含: 欢迎订阅 YY滴C专栏!更多干货持续更新!以下是传送门! 目录 一、queue 类——基本介绍二、queue 类…

Nginx 单个端口代理Minio

背景 最近使用某运营商的云服务器作为正式环境服务器,申请的时候只申请了一个端口,我们的前端页面及后台服务,还有minio,都需要nginx代理这个端口去进行访问。 server {# 监听端口7878listen 7878;server_name localhost;# 前端…

【赠书第3期】用ChatGPT轻松玩转机器学习与深度学习

文章目录 前言 1 机器学习 2 深度学习 3 使用ChatGPT进行机器学习和深度学习 4 推荐图书 5 粉丝福利 前言 机器学习和深度学习是当前最热门的技术领域之一,这些技术正在不断地改变我们的生活和工作方式。ChatGPT 是一款基于大规模预训练模型的自然语言处理工…

(const char *format, ...) 可变参数在文本日志中的巧妙使用

1. va_list是C语言中的一个数据类型,用于处理可变参数列表。它通常与stdarg.h头文件一起使用,该头文件提供了一组宏和函数来处理可变参数。 va_list类型用于存储一系列类型未知的参数,这些参数可以是任意类型,包括整数、浮点数、…

java读取pdf数据

目录 读取方式有两种: 方式一: 方式一所需要的maven依赖如下: 方式一读取的Java代码如下: 方式二: 方式二所需要的maven依赖如下:

ubuntu连接蓝牙耳机

本人也是经历了重重困难,特写此篇希望对读者能够带来帮助 1. 编辑 /etc/bluetooth/main.conf 文件,设定ControllerMode bredr 这一步使用vim编写完成后,保存退出的时候,会显示说没有修改权限,执行以下命令 sudo chm…

【星海出品】flask 数据库问题

flask 和数据库的问题 pip install pymysql pip install flask-sqlalchemy1.Flask连接Mysql 新建flask项目,在app.py中编写 导入模块SQLAlchemy 创建SQLAlchemy实例对象,命名为db,将flask的实例对象app作为参数传给SQLAlchemy,将…

深入理解JVM虚拟机第二十一篇:详解JVM当中的操作数在栈以及分析操作数栈与字节码指令和执行引擎的关系图解

大神链接:作者有幸结识技术大神孙哥为好友,获益匪浅。现在把孙哥视频分享给大家。 孙哥链接:孙哥个人主页 作者简介:一个颜值99分,只比孙哥差一点的程序员 本专栏简介:话不多说,让我们一起干翻JVM 本文章简介:话不多说,让我们讲清楚JVM当中的操作数在栈以及分析操作数…

【Python基础】 Python设计模式之单例模式介绍

单例模式 1.设计模式2.单例设计模式的应用场景3.new方法4. Python 中的单例 1.设计模式 设计模式 是 前人工作的总结和提炼,通常,被人们广泛流传的设计模式都是针对 某一特定问题 的成熟的解决方案使用 设计模式 是为了可重用代码、让代码更容易被他人理…

【Qt】QPalette

2023年11月10日,周五上午 Palette意为“调色板”。 QPalette是Qt中用于管理控件调色板(颜色方案)的类。它允许你为Qt应用程序中的控件设置不同的颜色,以满足视觉设计需求。 QPalette可以管理各种控件的颜色属性,如前…

python解析xmind统计测试用例/测试点 个数及执行情况

前言:统计的是每个分支最后一个节点的状态 xmind版本 23.0911172 标记打开位置 标记规则如下 解释: res {"total": 0, "pass": 0, "fail": 0, "no_result": 0, "unfinished": 0, "now_fail…